{"text_format":"1","workbook":"xlsx","n_sheets":13,"sheets":["Audit details","Additional info production","Additional info priv. labelling","Additional info trade","Additional info service","Chapter 2 General requirements","Chapter 3 Production","Chapter 4 Trade","Chapter 5 Road transport","Chapter 6 Chartering","Chapter 7 Storage_Transshipment","QS-Soyplus","Corrective actions report"],"not_rendered":{"charts":0,"images":1,"macros":0,"external_links":0,"defined_names":7,"comments":0,"pivot_tables":0},"unopened":[],"bounds":{"document_bytes":16777216,"sheet_cells":100000,"rows_first":2000,"rows_last":500,"rows_between":2000,"halvings":0,"cell_chars":16384,"cell_head_chars":4096},"cells_cut":0,"cells_raw":0,"read":"whole","date_system":"1900"}

{"sheet":"Audit details","index":0,"n_rows":51,"n_cols":12,"rows_kept":51,"cut":false,"hidden":false,"merged":[[8,0,8,1],[8,2,8,10],[9,0,9,10],[13,2,13,10],[6,2,6,5],[6,9,6,10],[7,0,7,1],[7,2,7,5],[6,0,6,1],[14,0,14,1],[14,2,14,10],[10,0,10,10],[18,2,18,10],[17,0,17,1],[17,2,17,10],[12,0,12,1],[18,0,18,1],[15,0,15,1],[15,2,15,10],[16,0,16,1],[16,2,16,10],[12,2,12,10],[13,0,13,1],[0,0,0,10],[2,0,2,10],[3,0,3,1],[3,2,3,10],[5,0,5,1],[5,2,5,5],[5,9,5,10],[4,0,4,1],[4,2,4,10],[49,0,49,2],[49,4,49,10],[44,0,44,1],[44,2,44,5],[44,6,44,9],[46,0,46,2],[46,4,46,10],[45,0,45,1],[45,2,45,10],[30,0,30,10],[25,7,25,8],[48,0,48,10],[35,9,35,10],[35,1,35,8],[34,1,34,8],[34,9,34,10],[32,0,32,8],[32,9,32,10],[33,9,33,10],[33,1,33,8],[26,3,26,5],[26,7,26,8],[27,3,27,5],[25,3,25,5],[27,7,27,8],[21,0,21,10],[28,0,28,1],[28,2,28,10],[19,0,19,1],[19,2,19,5],[22,0,22,10],[24,0,24,10],[36,1,36,8],[36,9,36,10],[39,9,39,10],[40,9,40,10],[41,9,41,10],[41,1,41,8],[39,1,39,8],[40,1,40,8],[42,9,42,10],[42,1,42,8],[37,1,37,8],[37,9,37,10],[38,9,38,10],[38,1,38,8]]}
["Checklist Internal audit Feed sector",null,null,null,null,null,null,null,null,null,null,"System"]
[]
["Audit details"]
["Scheme participant"]
["QS identification number"]
["Date of audit (from)",null,null,null,null,null,"Date of audit (until)"]
{"$rows_left_out":46}
{"sheet":"Additional info production","index":1,"n_rows":34,"n_cols":1,"rows_kept":34,"cut":false,"hidden":false,"merged":[[5,0,5,10],[9,0,9,10],[10,0,12,10],[14,0,14,10],[19,0,20,10],[18,0,18,10],[16,0,16,4],[16,5,16,10],[34,0,36,10],[26,0,26,10],[33,0,33,10],[7,0,7,4],[7,5,7,10],[22,0,22,10],[24,0,24,4],[24,5,24,10],[27,0,27,10],[29,0,29,10],[31,0,31,4],[31,5,31,10]]}
[]
[]
[]
[]
[]
["Information on additive production (700)"]
{"$rows_left_out":29}
{"sheet":"Additional info priv. labelling","index":2,"n_rows":21,"n_cols":3,"rows_kept":21,"cut":false,"hidden":false,"merged":[[15,0,15,3],[0,0,0,10],[2,1,2,10],[3,0,3,10],[4,0,4,10],[5,0,13,10],[19,0,19,1],[19,3,19,10],[20,0,20,1],[20,3,20,10],[16,0,16,1],[16,2,16,10],[17,0,17,1],[17,3,17,10],[18,0,18,1],[18,3,18,10]]}
["Information on private labelling (74)"]
[]
[null,"Contract manufacturer *"]
["* Please indicate all companies (incl. location numbers) commissioned within the framework of contract manufacturing below:"]
["Name of the contract manufacturer "]
[]
{"$rows_left_out":16}
{"sheet":"Additional info trade","index":3,"n_rows":18,"n_cols":3,"rows_kept":18,"cut":false,"hidden":false,"merged":[[6,3,6,10],[7,3,7,10],[8,3,8,10],[9,3,9,10],[17,3,17,10],[11,3,11,10],[16,3,16,10],[15,3,15,10],[14,0,14,10],[12,3,12,10],[13,3,13,10],[0,0,0,10],[3,0,3,3],[3,4,3,10],[17,0,17,1],[11,0,11,1],[12,0,12,1],[13,0,13,1],[15,0,15,1],[16,0,16,1],[10,0,10,10],[8,0,8,1],[9,0,9,1],[5,0,5,1],[6,0,6,1],[7,0,7,1],[5,2,5,10]]}
["Details on trade (76)"]
[]
[]
["Tonnage trade with QS feed: "]
[]
["Traded feed:",null,"Please check if applicable."]
{"$rows_left_out":13}
{"sheet":"Additional info service","index":4,"n_rows":21,"n_cols":7,"rows_kept":21,"cut":false,"hidden":false,"merged":[[7,0,7,10],[12,0,12,10],[13,0,13,10],[14,1,14,10],[15,1,15,10],[9,1,9,10],[10,1,10,10],[8,0,8,10],[18,0,18,10],[19,1,19,4],[19,6,19,10],[20,1,20,10],[17,0,17,10]]}
[]
[]
[]
[]
[]
[]
{"$rows_left_out":16}
{"sheet":"Chapter 2 General requirements","index":5,"n_rows":59,"n_cols":26,"rows_kept":59,"cut":false,"hidden":false,"merged":[[8,1,8,9],[0,1,0,7],[2,1,2,9],[3,1,3,9],[37,1,37,9],[56,1,56,9],[44,1,44,9],[10,1,10,9],[13,1,13,9],[18,1,18,9],[24,1,24,9],[28,1,28,9],[34,1,34,9]]}
["Company:    ","_______________________________________",null,null,null,null,null,null,"Date: ","__________",null,1]
["Require\nment no.",null,null,"Checkliste","Criterion/requirement ","Criterion fulfilled","Criterion not fulfilled","not applicable","Comments/corrective\naction","Deadline for\ncorrection"]
["2","General requirements"]
["2.1","General system requirements"]
["2.1.1",null,null,null,"[K.O.] Company data",null,null,null,null,null,{"$f":"IF(B5=\"1\",IF(TRIM(F5)<>\"\",1,0),0)","v":0},{"$f":"IF(B5=\"3\",IF(TRIM(F5)<>\"\",1,0),0)","v":0},{"$f":"IF(B5=\"1\",IF(TRIM(G5)<>\"\",1,0),0)","v":0},{"$f":"IF(B5=\"3\",IF(TRIM(G5)<>\"\",1,0),0)","v":0},{"$f":"IF(B5=\"1\",IF(TRIM(H5)<>\"\",1,0),0)","v":0},{"$f":"IF(B5=\"3\",IF(TRIM(H5)<>\"\",1,0),0)","v":0},{"$f":"IF(B5=\"1\",IF(TRIM(I5)<>\"\",1,0),0)","v":0},{"$f":"IF(B5=\"3\",IF(TRIM(I5)<>\"\",1,0),0)","v":0},{"$f":"IF(B5=\"1\",IF(TRIM(#REF!)<>\"\",1,0),0)","v":0},{"$f":"IF(B5=\"3\",IF(TRIM(#REF!)<>\"\",1,0),0)","v":0},0,"203313003",{"$f":"IF(COUNTIF(A:A,\"*Stichpr*\")>0,IF(AND(RIGHT(A5,8)=\"Stichpr.\",B5=\"1\",D5=\"\"),IF(TRIM(#REF!)<>\"\",1,0),0),IF(AND(B5=\"1\",D5=\"\"),IF(TRIM(#REF!)<>\"\",1,0),0))","v":0},{"$f":"IF(COUNTIF(A:A,\"*Stichpr*\")>0,IF(AND(RIGHT(A5,8)=\"Stichpr.\",LEFT(A5,1)=\"a\",B5=\"1\",D5=\"\"),IF(TRIM(#REF!)<>\"\",1,0),0),IF(AND(LEFT(A5,1)=\"a\",B5=\"1\",D5=\"\"),IF(TRIM(#REF!)<>\"\",1,0),0))","v":0},{"$f":"IF(AND(B5=\"1\",LEFT(A5,1)=\"a\",D5=\"\"),IF(TRIM(I5)<>\"\",1,0),0)","v":0},{"$f":"IF(AND(TRIM(I5)<>\"\",D5<>\"\"),1,0)","v":0}]
["2.1.2",null,null,null,"[K.O.] Official registration and authorisation",null,null,null,null,null,{"$f":"IF(B6=\"1\",IF(TRIM(F6)<>\"\",1,0),0)","v":0},{"$f":"IF(B6=\"3\",IF(TRIM(F6)<>\"\",1,0),0)","v":0},{"$f":"IF(B6=\"1\",IF(TRIM(G6)<>\"\",1,0),0)","v":0},{"$f":"IF(B6=\"3\",IF(TRIM(G6)<>\"\",1,0),0)","v":0},{"$f":"IF(B6=\"1\",IF(TRIM(H6)<>\"\",1,0),0)","v":0},{"$f":"IF(B6=\"3\",IF(TRIM(H6)<>\"\",1,0),0)","v":0},{"$f":"IF(B6=\"1\",IF(TRIM(I6)<>\"\",1,0),0)","v":0},{"$f":"IF(B6=\"3\",IF(TRIM(I6)<>\"\",1,0),0)","v":0},{"$f":"IF(B6=\"1\",IF(TRIM(#REF!)<>\"\",1,0),0)","v":0},{"$f":"IF(B6=\"3\",IF(TRIM(#REF!)<>\"\",1,0),0)","v":0},0,"203313006",{"$f":"IF(COUNTIF(A:A,\"*Stichpr*\")>0,IF(AND(RIGHT(A6,8)=\"Stichpr.\",B6=\"1\",D6=\"\"),IF(TRIM(#REF!)<>\"\",1,0),0),IF(AND(B6=\"1\",D6=\"\"),IF(TRIM(#REF!)<>\"\",1,0),0))","v":0},{"$f":"IF(COUNTIF(A:A,\"*Stichpr*\")>0,IF(AND(RIGHT(A6,8)=\"Stichpr.\",LEFT(A6,1)=\"a\",B6=\"1\",D6=\"\"),IF(TRIM(#REF!)<>\"\",1,0),0),IF(AND(LEFT(A6,1)=\"a\",B6=\"1\",D6=\"\"),IF(TRIM(#REF!)<>\"\",1,0),0))","v":0},{"$f":"IF(AND(B6=\"1\",LEFT(A6,1)=\"a\",D6=\"\"),IF(TRIM(I6)<>\"\",1,0),0)","v":0},{"$f":"IF(AND(TRIM(I6)<>\"\",D6<>\"\"),1,0)","v":0}]
{"$rows_left_out":54}
{"sheet":"Chapter 3 Production","index":6,"n_rows":101,"n_cols":26,"rows_kept":101,"cut":false,"hidden":false,"merged":[[0,1,0,7],[37,1,37,9],[2,1,2,9],[3,1,3,9],[7,1,7,9],[9,1,9,9],[16,1,16,9],[19,1,19,9],[27,1,27,9],[31,1,31,9],[33,1,33,9],[70,1,70,9],[41,1,41,9],[43,1,43,9],[47,1,47,9],[49,1,49,9],[51,1,51,9],[54,1,54,9],[57,1,57,9],[59,1,59,9],[61,1,61,9],[65,1,65,9],[67,1,67,9],[98,1,98,9],[73,1,73,9],[76,1,76,9],[78,1,78,9],[81,1,81,9],[83,1,83,9],[96,1,96,9]]}
["Company:    ","_________________________________________",null,null,null,null,null,null,"Date:","__________",null,1]
["Require\nment no.",null,null,"Checkliste","Criterion/requirement ","Criterion fulfilled","Criterion not fulfilled","not applicable","Comments/corrective\naction ","Deadline for\ncorrection"]
["3","Requirements for feed production"]
["3.1","Product specifications for feed"]
["3.1.1",null,null,null,"[K.O.] Description of the feed produced",null,null,null,null,null,{"$f":"IF(B5=\"1\",IF(TRIM(F5)<>\"\",1,0),0)","v":0},{"$f":"IF(B5=\"3\",IF(TRIM(F5)<>\"\",1,0),0)","v":0},{"$f":"IF(B5=\"1\",IF(TRIM(G5)<>\"\",1,0),0)","v":0},{"$f":"IF(B5=\"3\",IF(TRIM(G5)<>\"\",1,0),0)","v":0},{"$f":"IF(B5=\"1\",IF(TRIM(H5)<>\"\",1,0),0)","v":0},{"$f":"IF(B5=\"3\",IF(TRIM(H5)<>\"\",1,0),0)","v":0},{"$f":"IF(B5=\"1\",IF(TRIM(#REF!)<>\"\",1,0),0)","v":0},{"$f":"IF(B5=\"3\",IF(TRIM(#REF!)<>\"\",1,0),0)","v":0},{"$f":"IF(B5=\"1\",IF(TRIM(I5)<>\"\",1,0),0)","v":0},{"$f":"IF(B5=\"3\",IF(TRIM(I5)<>\"\",1,0),0)","v":0},0,"203313173",{"$f":"IF(COUNTIF(A:A,\"*Stichpr*\")>0,IF(AND(RIGHT(A5,8)=\"Stichpr.\",B5=\"1\",D5=\"\"),IF(TRIM(I5)<>\"\",1,0),0),IF(AND(B5=\"1\",D5=\"\"),IF(TRIM(I5)<>\"\",1,0),0))","v":0},{"$f":"IF(COUNTIF(A:A,\"*Stichpr*\")>0,IF(AND(RIGHT(A5,8)=\"Stichpr.\",LEFT(A5,1)=\"a\",B5=\"1\",D5=\"\"),IF(TRIM(I5)<>\"\",1,0),0),IF(AND(LEFT(A5,1)=\"a\",B5=\"1\",D5=\"\"),IF(TRIM(I5)<>\"\",1,0),0))","v":0},{"$f":"IF(AND(B5=\"1\",LEFT(A5,1)=\"a\",D5=\"\"),IF(TRIM(#REF!)<>\"\",1,0),0)","v":0},{"$f":"IF(AND(TRIM(#REF!)<>\"\",D5<>\"\"),1,0)","v":{"$error":"#REF!"}}]
["3.1.2",null,null,null,"Information for customers",null,null,null,null,null,{"$f":"IF(B6=\"1\",IF(TRIM(F6)<>\"\",1,0),0)","v":0},{"$f":"IF(B6=\"3\",IF(TRIM(F6)<>\"\",1,0),0)","v":0},{"$f":"IF(B6=\"1\",IF(TRIM(G6)<>\"\",1,0),0)","v":0},{"$f":"IF(B6=\"3\",IF(TRIM(G6)<>\"\",1,0),0)","v":0},{"$f":"IF(B6=\"1\",IF(TRIM(H6)<>\"\",1,0),0)","v":0},{"$f":"IF(B6=\"3\",IF(TRIM(H6)<>\"\",1,0),0)","v":0},{"$f":"IF(B6=\"1\",IF(TRIM(#REF!)<>\"\",1,0),0)","v":0},{"$f":"IF(B6=\"3\",IF(TRIM(#REF!)<>\"\",1,0),0)","v":0},{"$f":"IF(B6=\"1\",IF(TRIM(I6)<>\"\",1,0),0)","v":0},{"$f":"IF(B6=\"3\",IF(TRIM(I6)<>\"\",1,0),0)","v":0},0,"203313176",{"$f":"IF(COUNTIF(A:A,\"*Stichpr*\")>0,IF(AND(RIGHT(A6,8)=\"Stichpr.\",B6=\"1\",D6=\"\"),IF(TRIM(I6)<>\"\",1,0),0),IF(AND(B6=\"1\",D6=\"\"),IF(TRIM(I6)<>\"\",1,0),0))","v":0},{"$f":"IF(COUNTIF(A:A,\"*Stichpr*\")>0,IF(AND(RIGHT(A6,8)=\"Stichpr.\",LEFT(A6,1)=\"a\",B6=\"1\",D6=\"\"),IF(TRIM(I6)<>\"\",1,0),0),IF(AND(LEFT(A6,1)=\"a\",B6=\"1\",D6=\"\"),IF(TRIM(I6)<>\"\",1,0),0))","v":0},{"$f":"IF(AND(B6=\"1\",LEFT(A6,1)=\"a\",D6=\"\"),IF(TRIM(#REF!)<>\"\",1,0),0)","v":0},{"$f":"IF(AND(TRIM(#REF!)<>\"\",D6<>\"\"),1,0)","v":{"$error":"#REF!"}}]
{"$rows_left_out":96}
{"sheet":"Chapter 4 Trade","index":7,"n_rows":79,"n_cols":26,"rows_kept":79,"cut":false,"hidden":false,"merged":[[64,1,64,9],[77,1,77,9],[51,1,51,9],[54,1,54,9],[57,1,57,9],[59,1,59,9],[62,1,62,9],[14,1,14,9],[48,1,48,9],[19,1,19,9],[21,1,21,9],[25,1,25,9],[29,1,29,9],[31,1,31,9],[35,1,35,9],[37,1,37,9],[39,1,39,9],[42,1,42,9],[44,1,44,9],[46,1,46,9],[0,1,0,7],[2,1,2,9],[3,1,3,9],[5,1,5,9],[11,1,11,9]]}
["Company:    ","______________________________________________",null,null,null,null,null,null,"Date:","__________",null,1]
["Require\nment no.",null,null,"Checkliste","Criterion/requirement","Criterion fulfilled","Criterion not fulfilled","not applicable","Comments/ corrective\naction ","Deadline for\ncorrection"]
["4.","Requirements for the trade of feed"]
["4.1","Supply specifications"]
["4.1.1",null,null,null,"Description of the feed",null,null,null,null,null,{"$f":"IF(B5=\"1\",IF(TRIM(F5)<>\"\",1,0),0)","v":0},{"$f":"IF(B5=\"3\",IF(TRIM(F5)<>\"\",1,0),0)","v":0},{"$f":"IF(B5=\"1\",IF(TRIM(G5)<>\"\",1,0),0)","v":0},{"$f":"IF(B5=\"3\",IF(TRIM(G5)<>\"\",1,0),0)","v":0},{"$f":"IF(B5=\"1\",IF(TRIM(H5)<>\"\",1,0),0)","v":0},{"$f":"IF(B5=\"3\",IF(TRIM(H5)<>\"\",1,0),0)","v":0},{"$f":"IF(B5=\"1\",IF(TRIM(#REF!)<>\"\",1,0),0)","v":0},{"$f":"IF(B5=\"3\",IF(TRIM(#REF!)<>\"\",1,0),0)","v":0},{"$f":"IF(B5=\"1\",IF(TRIM(I5)<>\"\",1,0),0)","v":0},{"$f":"IF(B5=\"3\",IF(TRIM(I5)<>\"\",1,0),0)","v":0},0,"203313472",{"$f":"IF(COUNTIF(A:A,\"*Stichpr*\")>0,IF(AND(RIGHT(A5,8)=\"Stichpr.\",B5=\"1\",D5=\"\"),IF(TRIM(I5)<>\"\",1,0),0),IF(AND(B5=\"1\",D5=\"\"),IF(TRIM(I5)<>\"\",1,0),0))","v":0},{"$f":"IF(COUNTIF(A:A,\"*Stichpr*\")>0,IF(AND(RIGHT(A5,8)=\"Stichpr.\",LEFT(A5,1)=\"a\",B5=\"1\",D5=\"\"),IF(TRIM(I5)<>\"\",1,0),0),IF(AND(LEFT(A5,1)=\"a\",B5=\"1\",D5=\"\"),IF(TRIM(I5)<>\"\",1,0),0))","v":0},{"$f":"IF(AND(B5=\"1\",LEFT(A5,1)=\"a\",D5=\"\"),IF(TRIM(#REF!)<>\"\",1,0),0)","v":0},{"$f":"IF(AND(TRIM(#REF!)<>\"\",D5<>\"\"),1,0)","v":{"$error":"#REF!"}}]
["4.2","Supply of feed"]
{"$rows_left_out":74}
{"sheet":"Chapter 5 Road transport","index":8,"n_rows":35,"n_cols":26,"rows_kept":35,"cut":false,"hidden":false,"merged":[[33,1,33,9],[9,1,9,9],[12,1,12,9],[18,1,18,9],[21,1,21,9],[23,1,23,9],[25,1,25,9],[3,1,3,9],[6,1,6,9],[0,1,0,7],[2,1,2,9],[31,1,31,9]]}
["Company:    ","______________________________________________",null,null,null,null,null,null,"Date:","__________",null,1]
["Require\nment no.",null,null,null,"Criterion/requirement","Criterion fulfilled","Criterion not fulfilled","not applicable","Comments/ corrective\naction ","Deadline for\ncorrection","As (1)","As (3)","Bs (1)","Bs (3)","Cs (1)","Cs (3)","Ds (1)","Ds (3)","Es (1)","Es (3)","QSGAPs",null,"Es (1) o KO","Es (1) o B","Ds (1) o B","KO"]
["5.","Requirements for the transportat of feed by road"]
["5.1","Process descriptions",null,null,null,null,null,null,null,null,{"$f":"IF(B5=\"1\",IF(TRIM(F5)<>\"\",1,0),0)","v":0},{"$f":"IF(B5=\"3\",IF(TRIM(F5)<>\"\",1,0),0)","v":0},{"$f":"IF(B5=\"1\",IF(TRIM(G5)<>\"\",1,0),0)","v":0},{"$f":"IF(B5=\"3\",IF(TRIM(G5)<>\"\",1,0),0)","v":0},{"$f":"IF(B5=\"1\",IF(TRIM(H5)<>\"\",1,0),0)","v":0},{"$f":"IF(B5=\"3\",IF(TRIM(H5)<>\"\",1,0),0)","v":0},{"$f":"IF(B5=\"1\",IF(TRIM(#REF!)<>\"\",1,0),0)","v":0},{"$f":"IF(B5=\"3\",IF(TRIM(#REF!)<>\"\",1,0),0)","v":0},{"$f":"IF(B5=\"1\",IF(TRIM(I5)<>\"\",1,0),0)","v":0},{"$f":"IF(B5=\"3\",IF(TRIM(I5)<>\"\",1,0),0)","v":0},0,"203313707",{"$f":"IF(COUNTIF(A:A,\"*Stichpr*\")>0,IF(AND(RIGHT(A5,8)=\"Stichpr.\",B5=\"1\",D5=\"\"),IF(TRIM(I5)<>\"\",1,0),0),IF(AND(B5=\"1\",D5=\"\"),IF(TRIM(I5)<>\"\",1,0),0))","v":0},{"$f":"IF(COUNTIF(A:A,\"*Stichpr*\")>0,IF(AND(RIGHT(A5,8)=\"Stichpr.\",LEFT(A5,1)=\"a\",B5=\"1\",D5=\"\"),IF(TRIM(I5)<>\"\",1,0),0),IF(AND(LEFT(A5,1)=\"a\",B5=\"1\",D5=\"\"),IF(TRIM(I5)<>\"\",1,0),0))","v":0},{"$f":"IF(AND(B5=\"1\",LEFT(A5,1)=\"a\",D5=\"\"),IF(TRIM(#REF!)<>\"\",1,0),0)","v":0},{"$f":"IF(AND(TRIM(#REF!)<>\"\",D5<>\"\"),1,0)","v":{"$error":"#REF!"}}]
["5.1.1",null,null,null,"[K.O.] Determination of processes",null,null,null,null,null,{"$f":"IF(B6=\"1\",IF(TRIM(F6)<>\"\",1,0),0)","v":0},{"$f":"IF(B6=\"3\",IF(TRIM(F6)<>\"\",1,0),0)","v":0},{"$f":"IF(B6=\"1\",IF(TRIM(G6)<>\"\",1,0),0)","v":0},{"$f":"IF(B6=\"3\",IF(TRIM(G6)<>\"\",1,0),0)","v":0},{"$f":"IF(B6=\"1\",IF(TRIM(H6)<>\"\",1,0),0)","v":0},{"$f":"IF(B6=\"3\",IF(TRIM(H6)<>\"\",1,0),0)","v":0},{"$f":"IF(B6=\"1\",IF(TRIM(#REF!)<>\"\",1,0),0)","v":0},{"$f":"IF(B6=\"3\",IF(TRIM(#REF!)<>\"\",1,0),0)","v":0},{"$f":"IF(B6=\"1\",IF(TRIM(I6)<>\"\",1,0),0)","v":0},{"$f":"IF(B6=\"3\",IF(TRIM(I6)<>\"\",1,0),0)","v":0},0,"203313710",{"$f":"IF(COUNTIF(A:A,\"*Stichpr*\")>0,IF(AND(RIGHT(A6,8)=\"Stichpr.\",B6=\"1\",D6=\"\"),IF(TRIM(I6)<>\"\",1,0),0),IF(AND(B6=\"1\",D6=\"\"),IF(TRIM(I6)<>\"\",1,0),0))","v":0},{"$f":"IF(COUNTIF(A:A,\"*Stichpr*\")>0,IF(AND(RIGHT(A6,8)=\"Stichpr.\",LEFT(A6,1)=\"a\",B6=\"1\",D6=\"\"),IF(TRIM(I6)<>\"\",1,0),0),IF(AND(LEFT(A6,1)=\"a\",B6=\"1\",D6=\"\"),IF(TRIM(I6)<>\"\",1,0),0))","v":0},{"$f":"IF(AND(B6=\"1\",LEFT(A6,1)=\"a\",D6=\"\"),IF(TRIM(#REF!)<>\"\",1,0),0)","v":0},{"$f":"IF(AND(TRIM(#REF!)<>\"\",D6<>\"\"),1,0)","v":{"$error":"#REF!"}}]
["5.1.2",null,null,null,"[K.O.] Subcontracting"]
{"$rows_left_out":30}
{"sheet":"Chapter 6 Chartering","index":9,"n_rows":12,"n_cols":26,"rows_kept":12,"cut":false,"hidden":false,"merged":[[0,1,0,7],[10,1,10,9],[2,1,2,9],[3,1,3,9],[5,1,5,9],[7,1,7,9]]}
["Company:    ","______________________________________________",null,null,null,null,null,null,"Date:","________",null,1]
["Require\nment no.",null,null,null,"Criterion/requirement","Criterion fulfilled","Criterion not fulfilled","not applicable","Comments/ corrective\naction ","Deadline for\ncorrection","As (1)","As (3)","Bs (1)","Bs (3)","Cs (1)","Cs (3)","Ds (1)","Ds (3)","Es (1)","Es (3)","QSGAPs",null,"Es (1) o KO","Es (1) o B","Ds (1) o B","KO"]
["6","Requirements for the charterer when transporting feed by railway, inland waterways or\nocean ships"]
["6.1","Process descriptions",null,null,null,null,null,null,null,null,{"$f":"IF(B5=\"1\",IF(TRIM(F5)<>\"\",1,0),0)","v":0},{"$f":"IF(B5=\"3\",IF(TRIM(F5)<>\"\",1,0),0)","v":0},{"$f":"IF(B5=\"1\",IF(TRIM(G5)<>\"\",1,0),0)","v":0},{"$f":"IF(B5=\"3\",IF(TRIM(G5)<>\"\",1,0),0)","v":0},{"$f":"IF(B5=\"1\",IF(TRIM(H5)<>\"\",1,0),0)","v":0},{"$f":"IF(B5=\"3\",IF(TRIM(H5)<>\"\",1,0),0)","v":0},{"$f":"IF(B5=\"1\",IF(TRIM(#REF!)<>\"\",1,0),0)","v":0},{"$f":"IF(B5=\"3\",IF(TRIM(#REF!)<>\"\",1,0),0)","v":0},{"$f":"IF(B5=\"1\",IF(TRIM(I5)<>\"\",1,0),0)","v":0},{"$f":"IF(B5=\"3\",IF(TRIM(I5)<>\"\",1,0),0)","v":0},0,"203313808",{"$f":"IF(COUNTIF(A:A,\"*Stichpr*\")>0,IF(AND(RIGHT(A5,8)=\"Stichpr.\",B5=\"1\",D5=\"\"),IF(TRIM(I5)<>\"\",1,0),0),IF(AND(B5=\"1\",D5=\"\"),IF(TRIM(I5)<>\"\",1,0),0))","v":0},{"$f":"IF(COUNTIF(A:A,\"*Stichpr*\")>0,IF(AND(RIGHT(A5,8)=\"Stichpr.\",LEFT(A5,1)=\"a\",B5=\"1\",D5=\"\"),IF(TRIM(I5)<>\"\",1,0),0),IF(AND(LEFT(A5,1)=\"a\",B5=\"1\",D5=\"\"),IF(TRIM(I5)<>\"\",1,0),0))","v":0},{"$f":"IF(AND(B5=\"1\",LEFT(A5,1)=\"a\",D5=\"\"),IF(TRIM(#REF!)<>\"\",1,0),0)","v":0},{"$f":"IF(AND(TRIM(#REF!)<>\"\",D5<>\"\"),1,0)","v":{"$error":"#REF!"}}]
["6.1.1",null,null,null,"[K.O.] Determination of processes"]
["6.2","Documentations",null,null,null,null,null,null,null,null,{"$f":"IF(B7=\"1\",IF(TRIM(F7)<>\"\",1,0),0)","v":0},{"$f":"IF(B7=\"3\",IF(TRIM(F7)<>\"\",1,0),0)","v":0},{"$f":"IF(B7=\"1\",IF(TRIM(G7)<>\"\",1,0),0)","v":0},{"$f":"IF(B7=\"3\",IF(TRIM(G7)<>\"\",1,0),0)","v":0},{"$f":"IF(B7=\"1\",IF(TRIM(H7)<>\"\",1,0),0)","v":0},{"$f":"IF(B7=\"3\",IF(TRIM(H7)<>\"\",1,0),0)","v":0},{"$f":"IF(B7=\"1\",IF(TRIM(#REF!)<>\"\",1,0),0)","v":0},{"$f":"IF(B7=\"3\",IF(TRIM(#REF!)<>\"\",1,0),0)","v":0},{"$f":"IF(B7=\"1\",IF(TRIM(I7)<>\"\",1,0),0)","v":0},{"$f":"IF(B7=\"3\",IF(TRIM(I7)<>\"\",1,0),0)","v":0},0,"203313814",{"$f":"IF(COUNTIF(A:A,\"*Stichpr*\")>0,IF(AND(RIGHT(A7,8)=\"Stichpr.\",B7=\"1\",D7=\"\"),IF(TRIM(I7)<>\"\",1,0),0),IF(AND(B7=\"1\",D7=\"\"),IF(TRIM(I7)<>\"\",1,0),0))","v":0},{"$f":"IF(COUNTIF(A:A,\"*Stichpr*\")>0,IF(AND(RIGHT(A7,8)=\"Stichpr.\",LEFT(A7,1)=\"a\",B7=\"1\",D7=\"\"),IF(TRIM(I7)<>\"\",1,0),0),IF(AND(LEFT(A7,1)=\"a\",B7=\"1\",D7=\"\"),IF(TRIM(I7)<>\"\",1,0),0))","v":0},{"$f":"IF(AND(B7=\"1\",LEFT(A7,1)=\"a\",D7=\"\"),IF(TRIM(#REF!)<>\"\",1,0),0)","v":0},{"$f":"IF(AND(TRIM(#REF!)<>\"\",D7<>\"\"),1,0)","v":{"$error":"#REF!"}}]
{"$rows_left_out":7}
{"sheet":"Chapter 7 Storage_Transshipment","index":10,"n_rows":44,"n_cols":26,"rows_kept":44,"cut":false,"hidden":false,"merged":[[42,1,42,9],[11,1,11,9],[15,1,15,9],[19,1,19,9],[21,1,21,9],[25,1,25,9],[27,1,27,9],[29,1,29,9],[32,1,32,9],[34,1,34,9],[37,1,37,9],[40,1,40,9],[2,1,2,9],[3,1,3,9],[5,1,5,9],[9,1,9,9],[0,1,0,7]]}
["Company:    ","______________________________________________",null,null,null,null,null,null,"Date:","__________",null,1]
["Require\nment no.",null,null,"Checkliste","Criterion/requirement","Criterion fulfilled","Criterion not fulfilled","not applicable","Comments/ corrective\naction ","Deadline for\ncorrection","As (1)","As (3)","Bs (1)","Bs (3)","Cs (1)","Cs (3)","Ds (1)","Ds (3)","Es (1)","Es (3)","QSGAPs",null,"Es (1) o KO","Es (1) o B","Ds (1) o B","KO"]
["7","Requirements for the storage and transhipment of feed"]
["7.1","Process descriptions",null,null,null,null,null,null,null,null,{"$f":"IF(B5=\"1\",IF(TRIM(F5)<>\"\",1,0),0)","v":0},{"$f":"IF(B5=\"3\",IF(TRIM(F5)<>\"\",1,0),0)","v":0},{"$f":"IF(B5=\"1\",IF(TRIM(G5)<>\"\",1,0),0)","v":0},{"$f":"IF(B5=\"3\",IF(TRIM(G5)<>\"\",1,0),0)","v":0},{"$f":"IF(B5=\"1\",IF(TRIM(H5)<>\"\",1,0),0)","v":0},{"$f":"IF(B5=\"3\",IF(TRIM(H5)<>\"\",1,0),0)","v":0},{"$f":"IF(B5=\"1\",IF(TRIM(#REF!)<>\"\",1,0),0)","v":0},{"$f":"IF(B5=\"3\",IF(TRIM(#REF!)<>\"\",1,0),0)","v":0},{"$f":"IF(B5=\"1\",IF(TRIM(I5)<>\"\",1,0),0)","v":0},{"$f":"IF(B5=\"3\",IF(TRIM(I5)<>\"\",1,0),0)","v":0},0,"203312865",{"$f":"IF(COUNTIF(A:A,\"*Stichpr*\")>0,IF(AND(RIGHT(A5,8)=\"Stichpr.\",B5=\"1\",D5=\"\"),IF(TRIM(I5)<>\"\",1,0),0),IF(AND(B5=\"1\",D5=\"\"),IF(TRIM(I5)<>\"\",1,0),0))","v":0},{"$f":"IF(COUNTIF(A:A,\"*Stichpr*\")>0,IF(AND(RIGHT(A5,8)=\"Stichpr.\",LEFT(A5,1)=\"a\",B5=\"1\",D5=\"\"),IF(TRIM(I5)<>\"\",1,0),0),IF(AND(LEFT(A5,1)=\"a\",B5=\"1\",D5=\"\"),IF(TRIM(I5)<>\"\",1,0),0))","v":0},{"$f":"IF(AND(B5=\"1\",LEFT(A5,1)=\"a\",D5=\"\"),IF(TRIM(#REF!)<>\"\",1,0),0)","v":0},{"$f":"IF(AND(TRIM(#REF!)<>\"\",D5<>\"\"),1,0)","v":{"$error":"#REF!"}}]
["7.1.1",null,null,null,"[K.O.] Storage processes"]
["7.2","Storage",null,null,null,null,null,null,null,null,{"$f":"IF(B7=\"1\",IF(TRIM(F7)<>\"\",1,0),0)","v":0},{"$f":"IF(B7=\"3\",IF(TRIM(F7)<>\"\",1,0),0)","v":0},{"$f":"IF(B7=\"1\",IF(TRIM(G7)<>\"\",1,0),0)","v":0},{"$f":"IF(B7=\"3\",IF(TRIM(G7)<>\"\",1,0),0)","v":0},{"$f":"IF(B7=\"1\",IF(TRIM(H7)<>\"\",1,0),0)","v":0},{"$f":"IF(B7=\"3\",IF(TRIM(H7)<>\"\",1,0),0)","v":0},{"$f":"IF(B7=\"1\",IF(TRIM(#REF!)<>\"\",1,0),0)","v":0},{"$f":"IF(B7=\"3\",IF(TRIM(#REF!)<>\"\",1,0),0)","v":0},{"$f":"IF(B7=\"1\",IF(TRIM(I7)<>\"\",1,0),0)","v":0},{"$f":"IF(B7=\"3\",IF(TRIM(I7)<>\"\",1,0),0)","v":0},0,"203312871",{"$f":"IF(COUNTIF(A:A,\"*Stichpr*\")>0,IF(AND(RIGHT(A7,8)=\"Stichpr.\",B7=\"1\",D7=\"\"),IF(TRIM(I7)<>\"\",1,0),0),IF(AND(B7=\"1\",D7=\"\"),IF(TRIM(I7)<>\"\",1,0),0))","v":0},{"$f":"IF(COUNTIF(A:A,\"*Stichpr*\")>0,IF(AND(RIGHT(A7,8)=\"Stichpr.\",LEFT(A7,1)=\"a\",B7=\"1\",D7=\"\"),IF(TRIM(I7)<>\"\",1,0),0),IF(AND(LEFT(A7,1)=\"a\",B7=\"1\",D7=\"\"),IF(TRIM(I7)<>\"\",1,0),0))","v":0},{"$f":"IF(AND(B7=\"1\",LEFT(A7,1)=\"a\",D7=\"\"),IF(TRIM(#REF!)<>\"\",1,0),0)","v":0},{"$f":"IF(AND(TRIM(#REF!)<>\"\",D7<>\"\"),1,0)","v":{"$error":"#REF!"}}]
{"$rows_left_out":39}
{"sheet":"QS-Soyplus","index":11,"n_rows":47,"n_cols":26,"rows_kept":47,"cut":false,"hidden":false,"merged":[[44,1,44,9],[41,1,41,9],[0,1,0,7],[2,1,2,9],[4,1,4,9],[12,1,12,9],[16,1,16,9],[18,1,18,9],[22,1,22,9],[24,1,24,9],[29,1,29,9],[33,1,33,9],[37,1,37,9]]}
["Company:    ","______________________________________________",null,null,null,null,null,null,"Date:","__________",null,1]
["Require\nment no.",null,null,"Checkliste","Criterion/requirement","Criterion fulfilled","Criterion not fulfilled","not applicable","Comments/ corrective\naction ","Deadline for\ncorrection","As (1)","As (3)","Bs (1)","Bs (3)","Cs (1)","Cs (3)","Ds (1)","Ds (3)","Es (1)","Es (3)","QSGAPs",null,"Es (1) o KO","Es (1) o B","Ds (1) o B","KO"]
["II","Add-on module QS-Soyplus"]
["II. 2",null,null,null,"Requirements QS-Soyplus",null,null,null,null,null,{"$f":"IF(B6=\"1\",IF(TRIM(F6)<>\"\",1,0),0)","v":0},{"$f":"IF(B6=\"3\",IF(TRIM(F6)<>\"\",1,0),0)","v":0},{"$f":"IF(B6=\"1\",IF(TRIM(G6)<>\"\",1,0),0)","v":0},{"$f":"IF(B6=\"3\",IF(TRIM(G6)<>\"\",1,0),0)","v":0},{"$f":"IF(B6=\"1\",IF(TRIM(H6)<>\"\",1,0),0)","v":0},{"$f":"IF(B6=\"3\",IF(TRIM(H6)<>\"\",1,0),0)","v":0},{"$f":"IF(B6=\"1\",IF(TRIM(#REF!)<>\"\",1,0),0)","v":0},{"$f":"IF(B6=\"3\",IF(TRIM(#REF!)<>\"\",1,0),0)","v":0},{"$f":"IF(B6=\"1\",IF(TRIM(I6)<>\"\",1,0),0)","v":0},{"$f":"IF(B6=\"3\",IF(TRIM(I6)<>\"\",1,0),0)","v":0},0,"203312865",{"$f":"IF(COUNTIF(A:A,\"*Stichpr*\")>0,IF(AND(RIGHT(A6,8)=\"Stichpr.\",B6=\"1\",D6=\"\"),IF(TRIM(I6)<>\"\",1,0),0),IF(AND(B6=\"1\",D6=\"\"),IF(TRIM(I6)<>\"\",1,0),0))","v":0},{"$f":"IF(COUNTIF(A:A,\"*Stichpr*\")>0,IF(AND(RIGHT(A6,8)=\"Stichpr.\",LEFT(A6,1)=\"a\",B6=\"1\",D6=\"\"),IF(TRIM(I6)<>\"\",1,0),0),IF(AND(LEFT(A6,1)=\"a\",B6=\"1\",D6=\"\"),IF(TRIM(I6)<>\"\",1,0),0))","v":0},{"$f":"IF(AND(B6=\"1\",LEFT(A6,1)=\"a\",D6=\"\"),IF(TRIM(#REF!)<>\"\",1,0),0)","v":0},{"$f":"IF(AND(TRIM(#REF!)<>\"\",D6<>\"\"),1,0)","v":{"$error":"#REF!"}}]
["II. 2.1","General requirements"]
["II. 2.1.1",null,null,null,"Responsibilities and human resources",null,null,null,null,null,{"$f":"IF(B14=\"1\",IF(TRIM(F14)<>\"\",1,0),0)","v":0},{"$f":"IF(B14=\"3\",IF(TRIM(F14)<>\"\",1,0),0)","v":0},{"$f":"IF(B14=\"1\",IF(TRIM(G14)<>\"\",1,0),0)","v":0},{"$f":"IF(B14=\"3\",IF(TRIM(G14)<>\"\",1,0),0)","v":0},{"$f":"IF(B14=\"1\",IF(TRIM(H14)<>\"\",1,0),0)","v":0},{"$f":"IF(B14=\"3\",IF(TRIM(H14)<>\"\",1,0),0)","v":0},{"$f":"IF(B14=\"1\",IF(TRIM(#REF!)<>\"\",1,0),0)","v":0},{"$f":"IF(B14=\"3\",IF(TRIM(#REF!)<>\"\",1,0),0)","v":0},{"$f":"IF(B14=\"1\",IF(TRIM(I14)<>\"\",1,0),0)","v":0},{"$f":"IF(B14=\"3\",IF(TRIM(I14)<>\"\",1,0),0)","v":0},0,"203312871",{"$f":"IF(COUNTIF(A:A,\"*Stichpr*\")>0,IF(AND(RIGHT(A14,8)=\"Stichpr.\",B14=\"1\",D14=\"\"),IF(TRIM(I14)<>\"\",1,0),0),IF(AND(B14=\"1\",D14=\"\"),IF(TRIM(I14)<>\"\",1,0),0))","v":0},{"$f":"IF(COUNTIF(A:A,\"*Stichpr*\")>0,IF(AND(RIGHT(A14,8)=\"Stichpr.\",LEFT(A14,1)=\"a\",B14=\"1\",D14=\"\"),IF(TRIM(I14)<>\"\",1,0),0),IF(AND(LEFT(A14,1)=\"a\",B14=\"1\",D14=\"\"),IF(TRIM(I14)<>\"\",1,0),0))","v":0},{"$f":"IF(AND(B14=\"1\",LEFT(A14,1)=\"a\",D14=\"\"),IF(TRIM(#REF!)<>\"\",1,0),0)","v":0},{"$f":"IF(AND(TRIM(#REF!)<>\"\",D14<>\"\"),1,0)","v":{"$error":"#REF!"}}]
{"$rows_left_out":42}
{"sheet":"Corrective actions report","index":12,"n_rows":16,"n_cols":12,"rows_kept":16,"cut":false,"hidden":false,"merged":[[3,0,3,5],[0,1,0,3],[0,7,0,9],[7,9,7,10],[8,9,8,10],[4,0,4,5],[14,9,14,10],[15,9,15,10],[9,9,9,10],[10,9,10,10],[11,9,11,10],[12,9,12,10],[13,9,13,10]]}
["Company:",null,null,null,"Date:",{"$f":"IF(ISBLANK('Audit details'!C6),\"\",'Audit details'!C6)","v":""},"Company: ",{"$f":"IF(B1<>\"\",B1,\"\")","v":""},null,null,"Date:     ",{"$f":"IF(ISBLANK('Audit details'!C6),\"\",'Audit details'!C6)","v":""}]
[null,null,null,{"$f":"COUNTA(B9:B101)","v":0},"Massnahmenplan"]
["Corrective actions report",null,null,null,null,null,"Review of the implementation of corrective actions"]
[]
[]
[]
{"$rows_left_out":10}